Reaction Details
TargetSteroid hormone receptor ERR2
LigandBDBM50233272
Substrate/Competitorn/a
Meas. Tech.ChEMBL_1650379 (CHEMBL3999513)
IC50 1100±n/a nM
Citation Yu, DDHuss, JMLi, HForman, BM Identification of novel inverse agonists of estrogen-related receptors ERR¿ and ERRß. Bioorg Med Chem25:1585-1599 (2017) 
 
Steroid hormone receptor ERR2
Name:Steroid hormone receptor ERR2
Type:PROTEIN
Mol. Mass.:48061.77
Organism:Homo sapiens (Human)
Description:ChEMBL_11254
Residue:433
BDBM50233272
NameBDBM50233272
Synonyms:CHEMBL4064246
TypeSmall organic molecule
Emp. Form.C29H33NO4
Mol. Mass.459.5766
SMILESCN(C)CCOc1ccc(cc1)C(=C(\CCCO)c1ccccc1)\c1ccc(OC(C)=O)cc1