Reaction Details
TargetOrexin receptor type 2
LigandBDBM50233291
Substrate/Competitorn/a
Meas. Tech.ChEMBL_1650583 (CHEMBL3999717)
Ki 2.5±n/a nM
Citation Skudlarek, JWDiMarco, CNBabaoglu, KRoecker, AJBruno, JGPausch, MAO'Brien, JACabalu, TDStevens, JBrunner, JTannenbaum, PLWuelfing, WPGarson, SLFox, SVSavitz, ATHarrell, CMGotter, ALWinrow, CJRenger, JJKuduk, SDColeman, PJ Investigation of orexin-2 selective receptor antagonists: Structural modifications resulting in dual orexin receptor antagonists. Bioorg Med Chem Lett27:1364-1370 (2017) 
 
Orexin receptor type 2
Name:Orexin receptor type 2
Type:Protein
Mol. Mass.:50710.53
Organism:Homo sapiens (Human)
Description:O43614
Residue:444
BDBM50233291
NameBDBM50233291
Synonyms:CHEMBL4099612
TypeSmall organic molecule
Emp. Form.C22H23N5O4
Mol. Mass.421.4491
SMILESCOC(=O)c1cccnc1O[C@@H]1CC[C@@H](C)N(C1)C(=O)c1ccccc1-n1nccn1