Reaction Details
TargetOrexin receptor type 2
LigandBDBM203419
Substrate/Competitorn/a
Meas. Tech.ChEMBL_1650583 (CHEMBL3999717)
Ki 1.7±n/a nM
Citation Skudlarek, JWDiMarco, CNBabaoglu, KRoecker, AJBruno, JGPausch, MAO'Brien, JACabalu, TDStevens, JBrunner, JTannenbaum, PLWuelfing, WPGarson, SLFox, SVSavitz, ATHarrell, CMGotter, ALWinrow, CJRenger, JJKuduk, SDColeman, PJ Investigation of orexin-2 selective receptor antagonists: Structural modifications resulting in dual orexin receptor antagonists. Bioorg Med Chem Lett27:1364-1370 (2017) 
 
Orexin receptor type 2
Name:Orexin receptor type 2
Type:Protein
Mol. Mass.:50710.53
Organism:Homo sapiens (Human)
Description:O43614
Residue:444
BDBM203419
NameBDBM203419
Synonyms:2-({(3r,6r)-1-[(2-cyclopropyl- 6-methoxypyridin-3- yl)carbonyl]-6- methylpiperidin-3-yl}oxy)-3- methylpyridine-4-carbonitrile | US9546152, example 5
TypeSmall organic molecule
Emp. Form.C23H26N4O3
Mol. Mass.406.4775
SMILESCOc1ccc(C(=O)N2C[C@@H](CC[C@H]2C)Oc2nccc(C#N)c2C)c(n1)C1CC1