Reaction Details
TargetSphingosine 1-phosphate receptor 1
LigandBDBM23165
Substrate/Competitorn/a
Meas. Tech.ChEMBL_1650738 (CHEMBL3999872)
EC50 7.0±n/a nM
Citation James, EPertusati, FBrancale, AMcGuigan, C Kinase-independent phosphoramidate S1P Bioorg Med Chem Lett27:1371-1378 (2017) 
 
Sphingosine 1-phosphate receptor 1
Name:Sphingosine 1-phosphate receptor 1
Type:Enzyme
Mol. Mass.:42836.02
Organism:Homo sapiens (Human)
Description:P21453
Residue:382
BDBM23165
NameBDBM23165
Synonyms:CHEMBL366208 [(2S)-2-amino-3-hydroxy-2-[2-(4-octylphenyl)ethyl]propoxy]phosphonic acid
TypeSmall organic molecule
Emp. Form.C19H34NO5P
Mol. Mass.387.4507
SMILESCCCCCCCCc1ccc(CC[C@](N)(CO)COP(O)(O)=O)cc1