Reaction Details
TargetTyrosine-protein kinase BTK
LigandBDBM288531
Substrate/Competitorn/a
Meas. Tech.ChEMBL_1650766 (CHEMBL3999900)
IC50 0.100000±n/a nM
Citation Gao, XWang, JLiu, JGuiadeen, DKrikorian, ABoga, SBAlhassan, ABSelyutin, OYu, WYu, YAnand, RLiu, SYang, CWu, HCai, JCooper, AZhu, HMaloney, KGao, YDFischmann, TOPresland, JMansueto, MXu, ZLeccese, EZhang-Hoover, JKnemeyer, IGarlisi, CGBays, NStivers, PBrandish, PEHicks, AKim, RKozlowski, JA Discovery of novel BTK inhibitors with carboxylic acids. Bioorg Med Chem Lett27:1471-1477 (2017) 
 
Tyrosine-protein kinase BTK
Name:Tyrosine-protein kinase BTK
Type:Enzyme
Mol. Mass.:76289.95
Organism:Homo sapiens (Human)
Description:Q06187
Residue:659
BDBM288531
NameBDBM288531
Synonyms:(1R,3R,5S,6r)-3-[8- amino-1-(4-{[4- (trifluoromethyl) pyridin-2- yl]carbamoyl}phenyl) imidazo[1,5-a]pyrazin- 3- yl]bicyclo[3.1.0] hexane-6-carboxylic acid | US10087188, Example 139
TypeSmall organic molecule
Emp. Form.C26H21F3N6O3
Mol. Mass.522.4785
SMILESNc1nccn2c(nc(-c3ccc(cc3)C(=O)Nc3cc(ccn3)C(F)(F)F)c12)[C@@H]1C[C@H]2[C@@H](C1)[C@@H]2C(O)=O