Reaction Details
TargetPotassium voltage-gated channel subfamily H member 2
LigandBDBM267790
Substrate/Competitorn/a
Meas. Tech.ChEMBL_1650772 (CHEMBL3999906)
IC50 4300±n/a nM
Citation Gao, XWang, JLiu, JGuiadeen, DKrikorian, ABoga, SBAlhassan, ABSelyutin, OYu, WYu, YAnand, RLiu, SYang, CWu, HCai, JCooper, AZhu, HMaloney, KGao, YDFischmann, TOPresland, JMansueto, MXu, ZLeccese, EZhang-Hoover, JKnemeyer, IGarlisi, CGBays, NStivers, PBrandish, PEHicks, AKim, RKozlowski, JA Discovery of novel BTK inhibitors with carboxylic acids. Bioorg Med Chem Lett27:1471-1477 (2017) 
 
Potassium voltage-gated channel subfamily H member 2
Name:Potassium voltage-gated channel subfamily H member 2
Type:Multi-pass membrane protein
Mol. Mass.:126672.65
Organism:Homo sapiens (Human)
Description:Q12809
Residue:1159
BDBM267790
NameBDBM267790
Synonyms:4-(8-amino-3-{(3R,6S)-6-methyl-1-[(3-methyloxetan-3-yl)carbonyl]piperidin-3-yl}imidazo[1,5-a]pyrazin-1-yl)-3-fluoro-N-[4-(trifluoromethyl)pyridin-2-yl]benzamide | US9718828, Example, 396
TypeSmall organic molecule
Emp. Form.C29H27F4N7O2
Mol. Mass.581.564
SMILESC[C@H]1CC[C@H](CN1C(=O)C1CC1)c1nc(-c2ccc(cc2F)C(=O)Nc2cc(ccn2)C(F)(F)F)c2c(N)nccn12