Reaction Details
TargetSodium channel protein type 5 subunit alpha
LigandBDBM288473
Substrate/Competitorn/a
Meas. Tech.ChEMBL_1650774 (CHEMBL3999908)
IC50>30000±n/a nM
Citation Gao, XWang, JLiu, JGuiadeen, DKrikorian, ABoga, SBAlhassan, ABSelyutin, OYu, WYu, YAnand, RLiu, SYang, CWu, HCai, JCooper, AZhu, HMaloney, KGao, YDFischmann, TOPresland, JMansueto, MXu, ZLeccese, EZhang-Hoover, JKnemeyer, IGarlisi, CGBays, NStivers, PBrandish, PEHicks, AKim, RKozlowski, JA Discovery of novel BTK inhibitors with carboxylic acids. Bioorg Med Chem Lett27:1471-1477 (2017) 
 
Sodium channel protein type 5 subunit alpha
Name:Sodium channel protein type 5 subunit alpha
Type:Enzyme
Mol. Mass.:226908.60
Organism:Homo sapiens (Human)
Description:Q14524
Residue:2016
BDBM288473
NameBDBM288473
Synonyms:(1S,3R)-3-[8-amino-1- (4-{[4- (trifluoromethyl) pyridin-2- yl]carbamoyl}phenyl) imidazo[1,5-a]pyrazin- 3-yl]-1,3- dimethylcyclopentane carboxylic acid | US10087188, Example 80
TypeSmall organic molecule
Emp. Form.C27H25F3N6O3
Mol. Mass.538.521
SMILESC[C@@]1(CC[C@](C)(C1)c1nc(-c2ccc(cc2)C(=O)Nc2cc(ccn2)C(F)(F)F)c2c(N)nccn12)C(O)=O