Reaction Details
TargetTyrosine-protein kinase BTK
LigandBDBM288463
Substrate/Competitorn/a
Meas. Tech.ChEMBL_1650766 (CHEMBL3999900)
IC50 0.100000±n/a nM
Citation Gao, XWang, JLiu, JGuiadeen, DKrikorian, ABoga, SBAlhassan, ABSelyutin, OYu, WYu, YAnand, RLiu, SYang, CWu, HCai, JCooper, AZhu, HMaloney, KGao, YDFischmann, TOPresland, JMansueto, MXu, ZLeccese, EZhang-Hoover, JKnemeyer, IGarlisi, CGBays, NStivers, PBrandish, PEHicks, AKim, RKozlowski, JA Discovery of novel BTK inhibitors with carboxylic acids. Bioorg Med Chem Lett27:1471-1477 (2017) 
 
Tyrosine-protein kinase BTK
Name:Tyrosine-protein kinase BTK
Type:Enzyme
Mol. Mass.:76289.95
Organism:Homo sapiens (Human)
Description:Q06187
Residue:659
BDBM288463
NameBDBM288463
Synonyms:4-(8-amino-1-(2- fluoro-4-((4- (trifluoromethyl) pyridin-2- yl)carbamoyl)phenyl) imidazo[1,5-a]pyrazin- 3-yl)cubane-1- carboxylic acid | US10087188, Example 70
TypeSmall organic molecule
Emp. Form.C28H18F4N6O3
Mol. Mass.562.4745
SMILESNc1nccn2c(nc(-c3ccc(cc3F)C(=O)Nc3cc(ccn3)C(F)(F)F)c12)C12C3C4C1C1C2C3C41C(O)=O