Reaction Details
TargetTyrosine-protein kinase BTK
LigandBDBM50233393
Substrate/Competitorn/a
Meas. Tech.ChEMBL_1650766 (CHEMBL3999900)
IC50 0.400000±n/a nM
Citation Gao, XWang, JLiu, JGuiadeen, DKrikorian, ABoga, SBAlhassan, ABSelyutin, OYu, WYu, YAnand, RLiu, SYang, CWu, HCai, JCooper, AZhu, HMaloney, KGao, YDFischmann, TOPresland, JMansueto, MXu, ZLeccese, EZhang-Hoover, JKnemeyer, IGarlisi, CGBays, NStivers, PBrandish, PEHicks, AKim, RKozlowski, JA Discovery of novel BTK inhibitors with carboxylic acids. Bioorg Med Chem Lett27:1471-1477 (2017) 
 
Tyrosine-protein kinase BTK
Name:Tyrosine-protein kinase BTK
Type:Enzyme
Mol. Mass.:76289.95
Organism:Homo sapiens (Human)
Description:Q06187
Residue:659
BDBM50233393
NameBDBM50233393
Synonyms:CHEMBL4096195
TypeSmall organic molecule
Emp. Form.C29H29F3N6O3
Mol. Mass.566.5742
SMILESCC(C)[C@]1(CC[C@](C)(C1)c1nc(-c2ccc(cc2)C(=O)Nc2cc(ccn2)C(F)(F)F)c2c(N)nccn12)C(O)=O