Reaction Details
TargetTyrosine-protein kinase BTK
LigandBDBM288564
Substrate/Competitorn/a
Meas. Tech.ChEMBL_1650767 (CHEMBL3999901)
IC50 24±n/a nM
Citation Gao, XWang, JLiu, JGuiadeen, DKrikorian, ABoga, SBAlhassan, ABSelyutin, OYu, WYu, YAnand, RLiu, SYang, CWu, HCai, JCooper, AZhu, HMaloney, KGao, YDFischmann, TOPresland, JMansueto, MXu, ZLeccese, EZhang-Hoover, JKnemeyer, IGarlisi, CGBays, NStivers, PBrandish, PEHicks, AKim, RKozlowski, JA Discovery of novel BTK inhibitors with carboxylic acids. Bioorg Med Chem Lett27:1471-1477 (2017) 
 
Tyrosine-protein kinase BTK
Name:Tyrosine-protein kinase BTK
Type:Enzyme
Mol. Mass.:76289.95
Organism:Homo sapiens (Human)
Description:Q06187
Residue:659
BDBM288564
NameBDBM288564
Synonyms:4-[8-amino-1-(2- ethoxy-4-{[4- (trifluoromethyl) pyridin-2- yl]carbamoyl}phenyl) imidazo[1,5-a]pyrazin- 3- yl]bicyclo[2.2.2] octane-1-carboxylic acid | US10087188, Example 172
TypeSmall organic molecule
Emp. Form.C30H29F3N6O4
Mol. Mass.594.5843
SMILESCCOc1cc(ccc1-c1nc(n2ccnc(N)c12)C12CCC(CC1)(CC2)C(O)=O)C(=O)Nc1cc(ccn1)C(F)(F)F