Reaction Details
TargetOprd1b protein
LigandBDBM50233415
Substrate/Competitorn/a
Meas. Tech.ChEMBL_1650833 (CHEMBL3999967)
Ki 536±n/a nM
Citation Rosa, MGonzalez-Nunez, VBarreto-Valer, KMarcelo, FSánchez-Sánchez, JCalle, LPArévalo, JCRodríguez, REJiménez-Barbero, JArsequell, GValencia, G Role of the sugar moiety on the opioid receptor binding and conformation of a series of enkephalin neoglycopeptides. Bioorg Med Chem25:2260-2265 (2017) 
 
Oprd1b protein
Name:Oprd1b protein
Type:PROTEIN
Mol. Mass.:42202.89
Organism:Danio rerio
Description:ChEMBL_117316
Residue:375
BDBM50233415
NameBDBM50233415
Synonyms:CHEMBL4064725
TypeSmall organic molecule
Emp. Form.C36H50N6O12S
Mol. Mass.790.88
SMILES[H][C@]1(O[C@H]2C[C@H](N(C2)C(=O)[C@H](Cc2ccccc2)NC(=O)CNC(=O)[C@@H](CCSC)NC(=O)[C@@H](N)Cc2ccc(O)cc2)C(N)=O)O[C@H](CO)[C@@H](O)[C@H](O)[C@@H]1O