Reaction Details
TargetMu-type opioid receptor
LigandBDBM50233416
Substrate/Competitorn/a
Meas. Tech.ChEMBL_1650831 (CHEMBL3999965)
Ki 313±n/a nM
Citation Rosa, MGonzalez-Nunez, VBarreto-Valer, KMarcelo, FSánchez-Sánchez, JCalle, LPArévalo, JCRodríguez, REJiménez-Barbero, JArsequell, GValencia, G Role of the sugar moiety on the opioid receptor binding and conformation of a series of enkephalin neoglycopeptides. Bioorg Med Chem25:2260-2265 (2017) 
 
Mu-type opioid receptor
Name:Mu-type opioid receptor
Type:PROTEIN
Mol. Mass.:43012.33
Organism:Danio rerio
Description:ChEMBL_109864
Residue:382
BDBM50233416
NameBDBM50233416
Synonyms:CHEMBL4065055
TypeSmall organic molecule
Emp. Form.C36H50N6O12S
Mol. Mass.790.88
SMILES[H][C@@]1(O[C@H]2C[C@H](N(C2)C(=O)[C@H](Cc2ccccc2)NC(=O)CNC(=O)[C@@H](CCSC)NC(=O)[C@@H](N)Cc2ccc(O)cc2)C(N)=O)O[C@H](CO)[C@@H](O)[C@H](O)[C@H]1O