Reaction Details
TargetOprd1b protein
LigandBDBM50019056
Substrate/Competitorn/a
Meas. Tech.ChEMBL_1650833 (CHEMBL3999967)
Ki 45±n/a nM
Citation Rosa, MGonzalez-Nunez, VBarreto-Valer, KMarcelo, FSánchez-Sánchez, JCalle, LPArévalo, JCRodríguez, REJiménez-Barbero, JArsequell, GValencia, G Role of the sugar moiety on the opioid receptor binding and conformation of a series of enkephalin neoglycopeptides. Bioorg Med Chem25:2260-2265 (2017) 
 
Oprd1b protein
Name:Oprd1b protein
Type:PROTEIN
Mol. Mass.:42202.89
Organism:Danio rerio
Description:ChEMBL_117316
Residue:375
BDBM50019056
NameBDBM50019056
Synonyms:(S)-2-[(S)-2-(2-{2-[(S)-2-Amino-3-(4-hydroxy-phenyl)-propionylamino]-acetylamino}-acetylamino)-3-phenyl-propionylamino]-4-methylsulfanyl-butyric acid 2-[(S)-2-(2-{2-[(S)-2-Amino-3-(4-hydroxy-phenyl)-propionylamino]-acetylamino}-acetylamino)-1-oxo-3-phenyl-propylamino]-4-methylsulfanyl-butyric acid 2-[2-(2-{2-[2-Amino-3-(4-hydroxy-phenyl)-propionylamino]-acetylamino}-acetylamino)-3-phenyl-propionylamino]-4-methylsulfanyl-butyric acid H-Tyr-Gly-Gly-Phe-Met-OH [Met5]-enkephalin | met-enkephalin
TypeSmall organic molecule
Emp. Form.C27H35N5O7S
Mol. Mass.573.661
SMILESCSCC[C@H](NC(=O)[C@H](Cc1ccccc1)NC(=O)CNC(=O)CNC(=O)[C@@H](N)Cc1ccc(O)cc1)C(O)=O