Reaction Details
TargetOpioid receptor homologue
LigandBDBM50001465
Substrate/Competitorn/a
Meas. Tech.ChEMBL_1650832 (CHEMBL3999966)
Ki 73±n/a nM
Citation Rosa, MGonzalez-Nunez, VBarreto-Valer, KMarcelo, FSánchez-Sánchez, JCalle, LPArévalo, JCRodríguez, REJiménez-Barbero, JArsequell, GValencia, G Role of the sugar moiety on the opioid receptor binding and conformation of a series of enkephalin neoglycopeptides. Bioorg Med Chem25:2260-2265 (2017) 
 
Opioid receptor homologue
Name:Opioid receptor homologue
Type:PROTEIN
Mol. Mass.:42114.15
Organism:Danio rerio
Description:ChEMBL_117502
Residue:374
BDBM50001465
NameBDBM50001465
Synonyms:(S)-2-[(S)-2-(2-{2-[(S)-2-Amino-3-(4-hydroxy-phenyl)-propionylamino]-acetylamino}-acetylamino)-3-phenyl-propionylamino]-4-methyl-pentanoic acid (enkephalin)2-[2-(2-{2-[2-Amino-3-(4-hydroxy-phenyl)-propionylamino]-acetylamino}-acetylamino)-3-phenyl-propionylamino]-4-methyl-pentanoic acid 2-[(S)-2-(2-{2-[(S)-2-Amino-3-(4-hydroxy-phenyl)-propionylamino]-acetylamino}-acetylamino)-3-phenyl-propionylamino]-4-methyl-pentanoic acid 2-[2-(2-{2-[2-Amino-3-(4-hydroxy-phenyl)-propionylamino]-acetylamino}-acetylamino)-3-phenyl-propionylamino]-4-methyl-pentanoic acid 2-{1-[1-amino-2-(4-hydroxyphenyl)ethylcarboxamidomethylcarboxamidomethylcarboxamido]-2-phenylethylcarboxamido}-4-methylpentanoic acid ENKEPHALIN Leu5-Enkephalin | Tyr-Gly-Gly-Phe-Leu-OH
TypeSmall organic molecule
Emp. Form.C28H37N5O7
Mol. Mass.555.6227
SMILESCC(C)C[C@H](NC(=O)[C@H](Cc1ccccc1)NC(=O)CNC(=O)CNC(=O)[C@@H](N)Cc1ccc(O)cc1)C(O)=O