Reaction Details
TargetProstaglandin D2 receptor 2
LigandBDBM50233530
Substrate/Competitorn/a
Meas. Tech.ChEMBL_1650965 (CHEMBL4000099)
Ki 47±n/a nM
Citation Sandham, DABarker, LBrown, LBrown, ZBudd, DCharlton, SJChatterjee, DCox, BDubois, GDuggan, NHall, EHatto, JMaas, JManini, JProfit, RRiddy, DRitchie, CSohal, BShaw, DStringer, RSykes, DAThomas, MTurner, KLWatson, SJWest, RWillard, EWilliams, GWillis, J Discovery of Fevipiprant (NVP-QAW039), a Potent and Selective DP ACS Med Chem Lett8:582-586 (2017) 
 
Prostaglandin D2 receptor 2
Name:Prostaglandin D2 receptor 2
Type:Enzyme
Mol. Mass.:43295.45
Organism:Homo sapiens (Human)
Description:Q9Y5Y4
Residue:395
BDBM50233530
NameBDBM50233530
Synonyms:CHEMBL4086277
TypeSmall organic molecule
Emp. Form.C20H22N2O4S
Mol. Mass.386.465
SMILESCCc1ccc2c(CC(O)=O)c(C)n(Cc3ccc(cc3)S(C)(=O)=O)c2n1