Reaction Details
TargetProstaglandin D2 receptor 2
LigandBDBM50233522
Substrate/Competitorn/a
Meas. Tech.ChEMBL_1650965 (CHEMBL4000099)
Ki 7±n/a nM
Citation Sandham, DABarker, LBrown, LBrown, ZBudd, DCharlton, SJChatterjee, DCox, BDubois, GDuggan, NHall, EHatto, JMaas, JManini, JProfit, RRiddy, DRitchie, CSohal, BShaw, DStringer, RSykes, DAThomas, MTurner, KLWatson, SJWest, RWillard, EWilliams, GWillis, J Discovery of Fevipiprant (NVP-QAW039), a Potent and Selective DP ACS Med Chem Lett8:582-586 (2017) 
 
Prostaglandin D2 receptor 2
Name:Prostaglandin D2 receptor 2
Type:Enzyme
Mol. Mass.:43295.45
Organism:Homo sapiens (Human)
Description:Q9Y5Y4
Residue:395
BDBM50233522
NameBDBM50233522
Synonyms:CHEMBL3932668
TypeSmall organic molecule
Emp. Form.C20H19F3N2O4S
Mol. Mass.440.436
SMILESCCS(=O)(=O)c1ccc(Cn2c(C)c(CC(O)=O)c3cccnc23)c(c1)C(F)(F)F