Reaction Details
TargetProstaglandin D2 receptor 2
LigandBDBM50233526
Substrate/Competitorn/a
Meas. Tech.ChEMBL_1650965 (CHEMBL4000099)
Ki 31±n/a nM
Citation Sandham, DABarker, LBrown, LBrown, ZBudd, DCharlton, SJChatterjee, DCox, BDubois, GDuggan, NHall, EHatto, JMaas, JManini, JProfit, RRiddy, DRitchie, CSohal, BShaw, DStringer, RSykes, DAThomas, MTurner, KLWatson, SJWest, RWillard, EWilliams, GWillis, J Discovery of Fevipiprant (NVP-QAW039), a Potent and Selective DP ACS Med Chem Lett8:582-586 (2017) 
 
Prostaglandin D2 receptor 2
Name:Prostaglandin D2 receptor 2
Type:Enzyme
Mol. Mass.:43295.45
Organism:Homo sapiens (Human)
Description:Q9Y5Y4
Residue:395
BDBM50233526
NameBDBM50233526
Synonyms:CHEMBL3983909
TypeSmall organic molecule
Emp. Form.C19H17F3N2O4S
Mol. Mass.426.409
SMILESCc1c(CC(O)=O)c2cccnc2n1Cc1ccc(c(c1)C(F)(F)F)S(C)(=O)=O