Reaction Details
TargetCarbonic anhydrase 2
LigandBDBM50233535
Substrate/Competitorn/a
Meas. Tech.ChEBML_1651003
Ki 0.970000±n/a nM
Citation Boztas, MÇetinkaya, YTopal, MGülçin, IMenzek, ASahin, ETanc, MSupuran, CT Synthesis and carbonic anhydrase isoenzymes I, II, IX, and XII inhibitory effects of dimethoxybromophenol derivatives incorporating cyclopropane moieties. J Med Chem58:640-50 (2015) 
 
Carbonic anhydrase 2
Name:Carbonic anhydrase 2
Type:Enzyme
Mol. Mass.:29250.71
Organism:Homo sapiens (Human)
Description:P00918
Residue:260
BDBM50233535
NameBDBM50233535
Synonyms:CHEMBL4086787
TypeSmall organic molecule
Emp. Form.C15H18Br2O4
Mol. Mass.422.109
SMILESCCOC(=O)[C@@H]1C[C@@H]1Cc1cc(OC)c(OC)c(Br)c1Br