Reaction Details
TargetCarbonic anhydrase 2
LigandBDBM50233539
Substrate/Competitorn/a
Meas. Tech.ChEBML_1651003
Ki 24±n/a nM
Citation Boztas, MÇetinkaya, YTopal, MGülçin, IMenzek, ASahin, ETanc, MSupuran, CT Synthesis and carbonic anhydrase isoenzymes I, II, IX, and XII inhibitory effects of dimethoxybromophenol derivatives incorporating cyclopropane moieties. J Med Chem58:640-50 (2015) 
 
Carbonic anhydrase 2
Name:Carbonic anhydrase 2
Type:Enzyme
Mol. Mass.:29250.71
Organism:Homo sapiens (Human)
Description:P00918
Residue:260
BDBM50233539
NameBDBM50233539
Synonyms:CHEMBL4068228
TypeSmall organic molecule
Emp. Form.C13H16O4
Mol. Mass.236.2637
SMILESCOc1ccc(C[C@@H]2C[C@H]2C(O)=O)cc1OC