Reaction Details
TargetCarbonic anhydrase 1
LigandBDBM50233547
Substrate/Competitorn/a
Meas. Tech.ChEBML_1651002
Ki 4.5±n/a nM
Citation Boztas, MÇetinkaya, YTopal, MGülçin, IMenzek, ASahin, ETanc, MSupuran, CT Synthesis and carbonic anhydrase isoenzymes I, II, IX, and XII inhibitory effects of dimethoxybromophenol derivatives incorporating cyclopropane moieties. J Med Chem58:640-50 (2015) 
 
Carbonic anhydrase 1
Name:Carbonic anhydrase 1
Type:Enzyme
Mol. Mass.:28873.37
Organism:Homo sapiens (Human)
Description:P00915
Residue:261
BDBM50233547
NameBDBM50233547
Synonyms:CHEMBL4095455
TypeSmall organic molecule
Emp. Form.C15H18Br2O4
Mol. Mass.422.109
SMILESCCOC(=O)[C@@H]1C[C@H]1Cc1c(Br)cc(OC)c(OC)c1Br