Reaction Details
TargetCarbonic anhydrase 2
LigandBDBM50233550
Substrate/Competitorn/a
Meas. Tech.ChEMBL_1651003 (CHEMBL4000258)
Ki 6.4±n/a nM
Citation Boztas, MÇetinkaya, YTopal, MGülçin, IMenzek, ASahin, ETanc, MSupuran, CT Synthesis and carbonic anhydrase isoenzymes I, II, IX, and XII inhibitory effects of dimethoxybromophenol derivatives incorporating cyclopropane moieties. J Med Chem58:640-50 (2015) 
 
Carbonic anhydrase 2
Name:Carbonic anhydrase 2
Type:Enzyme
Mol. Mass.:29250.71
Organism:Homo sapiens (Human)
Description:P00918
Residue:260
BDBM50233550
NameBDBM50233550
Synonyms:CHEMBL4063516
TypeSmall organic molecule
Emp. Form.C13H14Br2O4
Mol. Mass.394.056
SMILESCOc1cc(C[C@H]2C[C@H]2C(O)=O)c(Br)c(Br)c1OC