Reaction Details
TargetCarbonic anhydrase 2
LigandBDBM50233593
Substrate/Competitorn/a
Meas. Tech.ChEMBL_1651003 (CHEMBL4000258)
Ki 12±n/a nM
Citation Boztas, MÇetinkaya, YTopal, MGülçin, IMenzek, ASahin, ETanc, MSupuran, CT Synthesis and carbonic anhydrase isoenzymes I, II, IX, and XII inhibitory effects of dimethoxybromophenol derivatives incorporating cyclopropane moieties. J Med Chem58:640-50 (2015) 
 
Carbonic anhydrase 2
Name:Carbonic anhydrase 2
Type:Enzyme
Mol. Mass.:29250.71
Organism:Homo sapiens (Human)
Description:P00918
Residue:260
BDBM50233593
NameBDBM50233593
Synonyms:CHEMBL4069416
TypeSmall organic molecule
Emp. Form.C13H13Br3O4
Mol. Mass.472.952
SMILESCOc1c(Br)c(Br)c(C[C@@H]2C[C@H]2C(O)=O)c(Br)c1OC