Reaction Details
TargetCarbonic anhydrase 9
LigandBDBM50233597
Substrate/Competitorn/a
Meas. Tech.ChEMBL_1651004 (CHEMBL4000259)
Ki>50000±n/a nM
Citation Boztas, MÇetinkaya, YTopal, MGülçin, IMenzek, ASahin, ETanc, MSupuran, CT Synthesis and carbonic anhydrase isoenzymes I, II, IX, and XII inhibitory effects of dimethoxybromophenol derivatives incorporating cyclopropane moieties. J Med Chem58:640-50 (2015) 
 
Carbonic anhydrase 9
Name:Carbonic anhydrase 9
Type:Enzyme
Mol. Mass.:49669.03
Organism:Homo sapiens (Human)
Description:Catalytic domain of human cloned isozyme was used in the assay
Residue:459
BDBM50233597
NameBDBM50233597
Synonyms:CHEMBL4091363
TypeSmall organic molecule
Emp. Form.C13H14Br2O4
Mol. Mass.394.056
SMILESCOc1cc(Br)c(C[C@H]2C[C@H]2C(O)=O)c(Br)c1OC