Reaction Details
TargetCarbonic anhydrase 1
LigandBDBM50233597
Substrate/Competitorn/a
Meas. Tech.ChEMBL_1651002 (CHEMBL4000257)
Ki 0.540000±n/a nM
Citation Boztas, MÇetinkaya, YTopal, MGülçin, IMenzek, ASahin, ETanc, MSupuran, CT Synthesis and carbonic anhydrase isoenzymes I, II, IX, and XII inhibitory effects of dimethoxybromophenol derivatives incorporating cyclopropane moieties. J Med Chem58:640-50 (2015) 
 
Carbonic anhydrase 1
Name:Carbonic anhydrase 1
Type:Enzyme
Mol. Mass.:28873.37
Organism:Homo sapiens (Human)
Description:P00915
Residue:261
BDBM50233597
NameBDBM50233597
Synonyms:CHEMBL4091363
TypeSmall organic molecule
Emp. Form.C13H14Br2O4
Mol. Mass.394.056
SMILESCOc1cc(Br)c(C[C@H]2C[C@H]2C(O)=O)c(Br)c1OC