Reaction Details
TargetCannabinoid receptor 1
LigandBDBM50233616
Substrate/Competitorn/a
Meas. Tech.ChEMBL_1651006 (CHEMBL4000261)
Ki 2.2±n/a nM
Citation Nikas, SPSharma, RParonis, CAKulkarni, SThakur, GAHurst, DWood, JTGifford, RSRajarshi, GLiu, YRaghav, JGGuo, JJJärbe, TUReggio, PHBergman, JMakriyannis, A Probing the carboxyester side chain in controlled deactivation (-)-d(8)-tetrahydrocannabinols. J Med Chem58:665-81 (2015) 
 
Cannabinoid receptor 1
Name:Cannabinoid receptor 1
Type:G Protein-Coupled Receptor (GPCR)
Mol. Mass.:52856.55
Organism:Rattus norvegicus (rat)
Description:P20272
Residue:473
BDBM50233616
NameBDBM50233616
Synonyms:CHEMBL4071457 | US10882838, Example 1.27
TypeSmall organic molecule
Emp. Form.C22H29BrO4
Mol. Mass.437.367
SMILES[H][C@@]12CC(C)=CC[C@@]1([H])C(C)(C)Oc1cc(CC(=O)OCCCCBr)cc(O)c21