Reaction Details
TargetD(2) dopamine receptor
LigandBDBM50233625
Substrate/Competitorn/a
Meas. Tech.ChEMBL_1651022 (CHEMBL4000277)
Ki 18±n/a nM
Citation Szabo, MLim, HDHerenbrink, CKChristopoulos, ALane, JRCapuano, B Proof of concept study for designed multiple ligands targeting the dopamine D2, serotonin 5-HT2A, and muscarinic M1 acetylcholine receptors. J Med Chem58:1550-5 (2015) 
 
D(2) dopamine receptor
Name:D(2) dopamine receptor
Type:Cell-surface receptors
Mol. Mass.:50647.10
Organism:Homo sapiens (Human)
Description:P14416
Residue:443
BDBM50233625
NameBDBM50233625
Synonyms:CHEMBL4090568
TypeSmall organic molecule
Emp. Form.C22H24N4O2S
Mol. Mass.408.517
SMILESO=C1COc2ccccc2N1CCCN1CCN(CC1)c1nsc2ccccc12