Reaction Details
Target5-hydroxytryptamine receptor 2A
LigandBDBM50233626
Substrate/Competitorn/a
Meas. Tech.ChEMBL_1651027 (CHEMBL4000282)
Ki 2.7±n/a nM
Citation Szabo, MLim, HDHerenbrink, CKChristopoulos, ALane, JRCapuano, B Proof of concept study for designed multiple ligands targeting the dopamine D2, serotonin 5-HT2A, and muscarinic M1 acetylcholine receptors. J Med Chem58:1550-5 (2015) 
 
5-hydroxytryptamine receptor 2A
Name:5-hydroxytryptamine receptor 2A
Type:undefined
Mol. Mass.:52607.65
Organism:Homo sapiens (Human)
Description:P28223
Residue:471
BDBM50233626
NameBDBM50233626
Synonyms:CHEMBL4062602
TypeSmall organic molecule
Emp. Form.C23H24FN3O3
Mol. Mass.409.4534
SMILESFc1ccc2c(noc2c1)C1CCN(CCCN2C(=O)COc3ccccc23)CC1