Reaction Details
TargetD(2) dopamine receptor
LigandBDBM50233626
Substrate/Competitorn/a
Meas. Tech.ChEMBL_1651022 (CHEMBL4000277)
Ki 3.2±n/a nM
Citation Szabo, MLim, HDHerenbrink, CKChristopoulos, ALane, JRCapuano, B Proof of concept study for designed multiple ligands targeting the dopamine D2, serotonin 5-HT2A, and muscarinic M1 acetylcholine receptors. J Med Chem58:1550-5 (2015) 
 
D(2) dopamine receptor
Name:D(2) dopamine receptor
Type:Cell-surface receptors
Mol. Mass.:50647.10
Organism:Homo sapiens (Human)
Description:P14416
Residue:443
BDBM50233626
NameBDBM50233626
Synonyms:CHEMBL4062602
TypeSmall organic molecule
Emp. Form.C23H24FN3O3
Mol. Mass.409.4534
SMILESFc1ccc2c(noc2c1)C1CCN(CCCN2C(=O)COc3ccccc23)CC1