Reaction Details
TargetTyrosine-protein kinase BTK
LigandBDBM50233654
Substrate/Competitorn/a
Meas. Tech.ChEMBL_1651104 (CHEMBL4000359)
IC50 6.7±n/a nM
Citation Zhao, XHuang, WWang, YXin, MJin, QCai, JTang, FZhao, YXiang, H Pyrrolo[2,3-b]pyridine derivatives as potent Bruton's tyrosine kinase inhibitors. Bioorg Med Chem23:4344-53 (2015) 
 
Tyrosine-protein kinase BTK
Name:Tyrosine-protein kinase BTK
Type:Enzyme
Mol. Mass.:76289.95
Organism:Homo sapiens (Human)
Description:Q06187
Residue:659
BDBM50233654
NameBDBM50233654
Synonyms:CHEMBL4087347
TypeSmall organic molecule
Emp. Form.C33H29FN4O3
Mol. Mass.548.6068
SMILESCC(=O)N1CCC(=CC1)c1cc2c(ccnc2[nH]1)-c1cccc(c1CO)-n1ccc2cc(cc(F)c2c1=O)C1CC1