Reaction Details
TargetSerine/threonine-protein kinase mTOR
LigandBDBM50233666
Substrate/Competitorn/a
Meas. Tech.ChEMBL_1651130 (CHEMBL4000385)
IC50 208±n/a nM
Citation Zhang, HXin, MHXie, XXMao, SZuo, SJLu, SMZhang, SQ Synthesis and antitumor activity evaluation of PI3K inhibitors containing 3-substituted quinazolin-4(3H)-one moiety. Bioorg Med Chem23:7765-76 (2015) 
 
Serine/threonine-protein kinase mTOR
Name:Serine/threonine-protein kinase mTOR
Type:Rapamycin target protein
Mol. Mass.:288917.12
Organism:Homo sapiens (Human)
Description:P42345
Residue:2549
BDBM50233666
NameBDBM50233666
Synonyms:CHEMBL4097625
TypeSmall organic molecule
Emp. Form.C28H26FN5O5S
Mol. Mass.563.6
SMILESCOc1ncc(cc1NS(=O)(=O)c1ccc(F)cc1)-c1ccc2ncn([C@H]3CCN(C3)C(=O)C3CC3)c(=O)c2c1