Reaction Details
TargetCollagenase 3
LigandBDBM50233879
Substrate/Competitorn/a
Meas. Tech.ChEMBL_1651669 (CHEMBL4000924)
IC50 0.093000±n/a nM
Citation Nara, HKaieda, ASato, KNaito, TMototani, HOki, HYamamoto, YKuno, HSantou, TKanzaki, NTerauchi, JUchikawa, OKori, M Discovery of Novel, Highly Potent, and Selective Matrix Metalloproteinase (MMP)-13 Inhibitors with a 1,2,4-Triazol-3-yl Moiety as a Zinc Binding Group Using a Structure-Based Design Approach. J Med Chem60:608-626 (2017) 
 
Collagenase 3
Name:Collagenase 3
Type:Enzyme
Mol. Mass.:53808.06
Organism:Homo sapiens (Human)
Description:P45452
Residue:471
BDBM50233879
NameBDBM50233879
Synonyms:CHEMBL4095557
TypeSmall organic molecule
Emp. Form.C24H19FN6O4S
Mol. Mass.506.509
SMILESFc1ccc(cc1)-c1csc2nc([nH]c(=O)c12)C(=O)NCc1cccc(OCCOc2nc[nH]n2)c1