Reaction Details
TargetCollagenase 3
LigandBDBM50233882
Substrate/Competitorn/a
Meas. Tech.ChEMBL_1651669 (CHEMBL4000924)
IC50 0.290000±n/a nM
Citation Nara, HKaieda, ASato, KNaito, TMototani, HOki, HYamamoto, YKuno, HSantou, TKanzaki, NTerauchi, JUchikawa, OKori, M Discovery of Novel, Highly Potent, and Selective Matrix Metalloproteinase (MMP)-13 Inhibitors with a 1,2,4-Triazol-3-yl Moiety as a Zinc Binding Group Using a Structure-Based Design Approach. J Med Chem60:608-626 (2017) 
 
Collagenase 3
Name:Collagenase 3
Type:Enzyme
Mol. Mass.:53808.06
Organism:Homo sapiens (Human)
Description:P45452
Residue:471
BDBM50233882
NameBDBM50233882
Synonyms:CHEMBL4079974
TypeSmall organic molecule
Emp. Form.C25H22N6O5S
Mol. Mass.518.544
SMILESCOc1ccccc1-c1csc2nc([nH]c(=O)c12)C(=O)NCc1cccc(OCCOc2nc[nH]n2)c1