Reaction Details
TargetNeutrophil collagenase
LigandBDBM50025159
Substrate/Competitorn/a
Meas. Tech.ChEMBL_1651671 (CHEMBL4000926)
IC50 1100±n/a nM
Citation Nara, HKaieda, ASato, KNaito, TMototani, HOki, HYamamoto, YKuno, HSantou, TKanzaki, NTerauchi, JUchikawa, OKori, M Discovery of Novel, Highly Potent, and Selective Matrix Metalloproteinase (MMP)-13 Inhibitors with a 1,2,4-Triazol-3-yl Moiety as a Zinc Binding Group Using a Structure-Based Design Approach. J Med Chem60:608-626 (2017) 
 
Neutrophil collagenase
Name:Neutrophil collagenase
Type:Enzyme
Mol. Mass.:53413.48
Organism:Homo sapiens (Human)
Description:P22894
Residue:467
BDBM50025159
NameBDBM50025159
Synonyms:CHEMBL3337869
TypeSmall organic molecule
Emp. Form.C17H15N3O3
Mol. Mass.309.3193
SMILESCOc1cccc(CNC(=O)c2nc3ccccc3c(=O)[nH]2)c1