Reaction Details
TargetInterstitial collagenase
LigandBDBM50025159
Substrate/Competitorn/a
Meas. Tech.ChEMBL_1651675 (CHEMBL4000930)
IC50>10000±n/a nM
Citation Nara, HKaieda, ASato, KNaito, TMototani, HOki, HYamamoto, YKuno, HSantou, TKanzaki, NTerauchi, JUchikawa, OKori, M Discovery of Novel, Highly Potent, and Selective Matrix Metalloproteinase (MMP)-13 Inhibitors with a 1,2,4-Triazol-3-yl Moiety as a Zinc Binding Group Using a Structure-Based Design Approach. J Med Chem60:608-626 (2017) 
 
Interstitial collagenase
Name:Interstitial collagenase
Type:Enzyme
Mol. Mass.:54010.26
Organism:Homo sapiens (Human)
Description: P03956
Residue:469
BDBM50025159
NameBDBM50025159
Synonyms:CHEMBL3337869
TypeSmall organic molecule
Emp. Form.C17H15N3O3
Mol. Mass.309.3193
SMILESCOc1cccc(CNC(=O)c2nc3ccccc3c(=O)[nH]2)c1