Reaction Details
TargetStromelysin-1
LigandBDBM11863
Substrate/Competitorn/a
Meas. Tech.ChEMBL_1651676 (CHEMBL4000931)
IC50 0.300000±n/a nM
Citation Nara, HKaieda, ASato, KNaito, TMototani, HOki, HYamamoto, YKuno, HSantou, TKanzaki, NTerauchi, JUchikawa, OKori, M Discovery of Novel, Highly Potent, and Selective Matrix Metalloproteinase (MMP)-13 Inhibitors with a 1,2,4-Triazol-3-yl Moiety as a Zinc Binding Group Using a Structure-Based Design Approach. J Med Chem60:608-626 (2017) 
 
Stromelysin-1
Name:Stromelysin-1
Type:Enzyme
Mol. Mass.:53973.13
Organism:Homo sapiens (Human)
Description: P08254
Residue:477
BDBM11863
NameBDBM11863
Synonyms:4-({[4-(4-chlorophenoxy)benzene]sulfonyl}methyl)-N-hydroxyoxane-4-carboxamide RS 130830 alpha-tetrahydropyran beta-sulfone 1B
TypeSmall organic molecule
Emp. Form.C19H20ClNO6S
Mol. Mass.425.883
SMILESONC(=O)C1(CS(=O)(=O)c2ccc(Oc3ccc(Cl)cc3)cc2)CCOCC1