Reaction Details
TargetMatrilysin
LigandBDBM11863
Substrate/Competitorn/a
Meas. Tech.ChEMBL_1651677 (CHEMBL4000932)
IC50 210±n/a nM
Citation Nara, HKaieda, ASato, KNaito, TMototani, HOki, HYamamoto, YKuno, HSantou, TKanzaki, NTerauchi, JUchikawa, OKori, M Discovery of Novel, Highly Potent, and Selective Matrix Metalloproteinase (MMP)-13 Inhibitors with a 1,2,4-Triazol-3-yl Moiety as a Zinc Binding Group Using a Structure-Based Design Approach. J Med Chem60:608-626 (2017) 
 
Matrilysin
Name:Matrilysin
Type:Enzyme
Mol. Mass.:29681.54
Organism:Homo sapiens (Human)
Description:P09237
Residue:267
BDBM11863
NameBDBM11863
Synonyms:4-({[4-(4-chlorophenoxy)benzene]sulfonyl}methyl)-N-hydroxyoxane-4-carboxamide RS 130830 alpha-tetrahydropyran beta-sulfone 1B
TypeSmall organic molecule
Emp. Form.C19H20ClNO6S
Mol. Mass.425.883
SMILESONC(=O)C1(CS(=O)(=O)c2ccc(Oc3ccc(Cl)cc3)cc2)CCOCC1