Reaction Details
TargetNeutrophil collagenase
LigandBDBM50233900
Substrate/Competitorn/a
Meas. Tech.ChEMBL_1651671 (CHEMBL4000926)
IC50 140±n/a nM
Citation Nara, HKaieda, ASato, KNaito, TMototani, HOki, HYamamoto, YKuno, HSantou, TKanzaki, NTerauchi, JUchikawa, OKori, M Discovery of Novel, Highly Potent, and Selective Matrix Metalloproteinase (MMP)-13 Inhibitors with a 1,2,4-Triazol-3-yl Moiety as a Zinc Binding Group Using a Structure-Based Design Approach. J Med Chem60:608-626 (2017) 
 
Neutrophil collagenase
Name:Neutrophil collagenase
Type:Enzyme
Mol. Mass.:53413.48
Organism:Homo sapiens (Human)
Description:P22894
Residue:467
BDBM50233900
NameBDBM50233900
Synonyms:CHEMBL4083954
TypeSmall organic molecule
Emp. Form.C20H18N6O3S
Mol. Mass.422.46
SMILESO=C(NCc1cccc(OCCSc2nc[nH]n2)c1)c1nc2ccccc2c(=O)[nH]1