Reaction Details
TargetStromelysin-2
LigandBDBM50233893
Substrate/Competitorn/a
Meas. Tech.ChEMBL_1651672 (CHEMBL4000927)
IC50 270±n/a nM
Citation Nara, HKaieda, ASato, KNaito, TMototani, HOki, HYamamoto, YKuno, HSantou, TKanzaki, NTerauchi, JUchikawa, OKori, M Discovery of Novel, Highly Potent, and Selective Matrix Metalloproteinase (MMP)-13 Inhibitors with a 1,2,4-Triazol-3-yl Moiety as a Zinc Binding Group Using a Structure-Based Design Approach. J Med Chem60:608-626 (2017) 
 
Stromelysin-2
Name:Stromelysin-2
Type:Enzyme
Mol. Mass.:54143.02
Organism:Homo sapiens (Human)
Description:P09238
Residue:476
BDBM50233893
NameBDBM50233893
Synonyms:CHEMBL4102420
TypeSmall organic molecule
Emp. Form.C20H19N7O3S
Mol. Mass.437.475
SMILESCc1csc2nc([nH]c(=O)c12)C(=O)NCc1cccc(NC(=O)CCc2nc[nH]n2)c1