Reaction Details
TargetSerine protease 1
LigandBDBM50124947
Substrate/Competitorn/a
Meas. Tech.ChEMBL_1651759 (CHEMBL4001014)
Ki 0.100000±n/a nM
Citation Qiu, YTaichi, MWei, NYang, HLuo, KQTam, JP An Orally Active Bradykinin B J Med Chem60:504-510 (2017) 
 
Serine protease 1
Name:Serine protease 1
Type:Enzyme
Mol. Mass.:25790.52
Organism:Bos taurus (bovine)
Description:P00760
Residue:246
BDBM50124947
NameBDBM50124947
Synonyms:CHEMBL453539
TypeSmall organic molecule
Emp. Form.C67H104N18O18S2
Mol. Mass.1513.782
SMILES[H][C@@]12CCCN1C(=O)[C@H](Cc1ccccc1)NC(=O)[C@]1([H])CSSC[C@]([H])(NC(=O)[C@H](CCCNC(N)=N)NC(=O)CNC(=O)[C@H](CC(O)=O)NC2=O)C(=O)N[C@@]([H])([C@@H](C)O)C(=O)N[C@@H](CCCCN)C(=O)N[C@@H](CO)C(=O)N[C@@]([H])([C@@H](C)CC)C(=O)N2CCC[C@@]2([H])C(=O)N2CCC[C@@]2([H])C(=O)N[C@@]([H])([C@@H](C)CC)C(=O)N1