Reaction Details
TargetEctonucleotide pyrophosphatase/phosphodiesterase family member 2
LigandBDBM50233930
Substrate/Competitorn/a
Meas. Tech.ChEMBL_1651767 (CHEMBL4001022)
IC50 25±n/a nM
Citation Miller, LMKeune, WJCastagna, DYoung, LCDuffy, ELPotjewyd, FSalgado-Polo, FEngel García, PSemaan, DPritchard, JMPerrakis, AMacdonald, SJJamieson, CWatson, AJ Structure-Activity Relationships of Small Molecule Autotaxin Inhibitors with a Discrete Binding Mode. J Med Chem60:722-748 (2017) 
 
Ectonucleotide pyrophosphatase/phosphodiesterase family member 2
Name:Ectonucleotide pyrophosphatase/phosphodiesterase family member 2
Type:Enzyme
Mol. Mass.:99007.13
Organism:Homo sapiens (Human)
Description:Q13822
Residue:863
BDBM50233930
NameBDBM50233930
Synonyms:CHEMBL4073328
TypeSmall organic molecule
Emp. Form.C15H11ClN2O2S
Mol. Mass.318.778
SMILESCc1[nH]c2cc(Cl)ccc2c1Sc1cccc(n1)C(O)=O