Reaction Details
TargetSodium-dependent dopamine transporter
LigandBDBM50005534
Substrate/Competitorn/a
Meas. Tech.ChEMBL_1651929 (CHEMBL4001184)
IC50 12±n/a nM
Citation Odell, LRAbdel-Hamid, MKHill, TAChau, NYoung, KADeane, FMSakoff, JAAndersson, SDaniel, JARobinson, PJMcCluskey, A Pyrimidine-Based Inhibitors of Dynamin I GTPase Activity: Competitive Inhibition at the Pleckstrin Homology Domain. J Med Chem60:349-361 (2017) 
 
Sodium-dependent dopamine transporter
Name:Sodium-dependent dopamine transporter
Type:Multi-pass membrane protein
Mol. Mass.:68497.11
Organism:Homo sapiens (Human)
Description:Q01959
Residue:620
BDBM50005534
NameBDBM50005534
Synonyms:1-(1-(benzo[b]thiophen-2-yl)cyclohexyl)piperidine 1-(1-Benzo[b]thiophen-2-yl-cyclohexyl)-piperidine(BTCP) 3-[(3-Chloro-phenyl)-phenyl-methoxy]-8-methyl-8-aza-bicyclo[3.2.1]octane | CHEMBL279556
TypeSmall organic molecule
Emp. Form.C19H25NS
Mol. Mass.299.474
SMILESC1CCN(CC1)C1(CCCCC1)c1cc2ccccc2s1