Reaction Details
TargetDynamin-2
LigandBDBM50233968
Substrate/Competitorn/a
Meas. Tech.ChEMBL_1651873 (CHEMBL4001128)
IC50 8500±n/a nM
Citation Odell, LRAbdel-Hamid, MKHill, TAChau, NYoung, KADeane, FMSakoff, JAAndersson, SDaniel, JARobinson, PJMcCluskey, A Pyrimidine-Based Inhibitors of Dynamin I GTPase Activity: Competitive Inhibition at the Pleckstrin Homology Domain. J Med Chem60:349-361 (2017) 
 
Dynamin-2
Name:Dynamin-2
Type:PROTEIN
Mol. Mass.:98071.19
Organism:Homo sapiens (Human)
Description:ChEMBL_934670
Residue:870
BDBM50233968
NameBDBM50233968
Synonyms:CHEMBL4082410
TypeSmall organic molecule
Emp. Form.C20H39N5
Mol. Mass.349.5572
SMILESCCCCCCCCCCCCNc1cc(NCCN(C)C)ncn1