Reaction Details
TargetSodium-dependent noradrenaline transporter
LigandBDBM50176062
Substrate/Competitorn/a
Meas. Tech.ChEMBL_1651928 (CHEMBL4001183)
Ki 2.1±n/a nM
Citation Odell, LRAbdel-Hamid, MKHill, TAChau, NYoung, KADeane, FMSakoff, JAAndersson, SDaniel, JARobinson, PJMcCluskey, A Pyrimidine-Based Inhibitors of Dynamin I GTPase Activity: Competitive Inhibition at the Pleckstrin Homology Domain. J Med Chem60:349-361 (2017) 
 
Sodium-dependent noradrenaline transporter
Name:Sodium-dependent noradrenaline transporter
Type:Multi-pass membrane protein
Mol. Mass.:69337.72
Organism:Homo sapiens (Human)
Description:P23975
Residue:617
BDBM50176062
NameBDBM50176062
Synonyms:3-(5H-dibenzo[a,d][7]annulen-5-yl)-N-methylpropan-1-amine 5-(3-methylaminopropyl)-5H-dibenzo[a,d]cycloheptene CHEMBL668 N-methyl-5H-dibenzo[a,d]cycloheptene-5-propylamine amimetilina
TypeSmall organic molecule
Emp. Form.C19H21N
Mol. Mass.263.3767
SMILESCNCCCC1c2ccccc2C=Cc2ccccc12