Reaction Details
TargetMicrotubule-associated protein 2
LigandBDBM50234020
Substrate/Competitorn/a
Meas. Tech.ChEMBL_1651976 (CHEMBL4001231)
IC50 1600±n/a nM
Citation Heinrich, TBuchstaller, HPCezanne, BRohdich, FBomke, JFriese-Hamim, MKrier, MKnöchel, TMusil, DLeuthner, BZenke, F Novel reversible methionine aminopeptidase-2 (MetAP-2) inhibitors based on purine and related bicyclic templates. Bioorg Med Chem Lett27:551-556 (2017) 
 
Microtubule-associated protein 2
Name:Microtubule-associated protein 2
Type:PROTEIN
Mol. Mass.:199423.64
Organism:Homo sapiens (Human)
Description:ChEMBL_107603
Residue:1827
BDBM50234020
NameBDBM50234020
Synonyms:CHEMBL4101592
TypeSmall organic molecule
Emp. Form.C16H15F2N5O
Mol. Mass.331.32
SMILESFc1cccc(OC[C@H]2CCCN2c2ncnc3[nH]cnc23)c1F