Reaction Details
TargetMicrotubule-associated protein 2
LigandBDBM50234028
Substrate/Competitorn/a
Meas. Tech.ChEMBL_1651976 (CHEMBL4001231)
IC50 2800±n/a nM
Citation Heinrich, TBuchstaller, HPCezanne, BRohdich, FBomke, JFriese-Hamim, MKrier, MKnöchel, TMusil, DLeuthner, BZenke, F Novel reversible methionine aminopeptidase-2 (MetAP-2) inhibitors based on purine and related bicyclic templates. Bioorg Med Chem Lett27:551-556 (2017) 
 
Microtubule-associated protein 2
Name:Microtubule-associated protein 2
Type:PROTEIN
Mol. Mass.:199423.64
Organism:Homo sapiens (Human)
Description:ChEMBL_107603
Residue:1827
BDBM50234028
NameBDBM50234028
Synonyms:CHEMBL4063448
TypeSmall organic molecule
Emp. Form.C16H15ClN4OS
Mol. Mass.346.835
SMILESClc1ccccc1OC[C@H]1CCCN1c1ccnc2nsnc12