Reaction Details
TargetMicrotubule-associated protein 2
LigandBDBM50234031
Substrate/Competitorn/a
Meas. Tech.ChEMBL_1651976 (CHEMBL4001231)
IC50 110±n/a nM
Citation Heinrich, TBuchstaller, HPCezanne, BRohdich, FBomke, JFriese-Hamim, MKrier, MKnöchel, TMusil, DLeuthner, BZenke, F Novel reversible methionine aminopeptidase-2 (MetAP-2) inhibitors based on purine and related bicyclic templates. Bioorg Med Chem Lett27:551-556 (2017) 
 
Microtubule-associated protein 2
Name:Microtubule-associated protein 2
Type:PROTEIN
Mol. Mass.:199423.64
Organism:Homo sapiens (Human)
Description:ChEMBL_107603
Residue:1827
BDBM50234031
NameBDBM50234031
Synonyms:CHEMBL4082542
TypeSmall organic molecule
Emp. Form.C20H19N5O
Mol. Mass.345.3978
SMILESC(Oc1cccc2ccccc12)[C@H]1CCCN1c1ccnc2ncnn12