Reaction Details
TargetMicrotubule-associated protein 2
LigandBDBM50234034
Substrate/Competitorn/a
Meas. Tech.ChEMBL_1651976 (CHEMBL4001231)
IC50 3800±n/a nM
Citation Heinrich, TBuchstaller, HPCezanne, BRohdich, FBomke, JFriese-Hamim, MKrier, MKnöchel, TMusil, DLeuthner, BZenke, F Novel reversible methionine aminopeptidase-2 (MetAP-2) inhibitors based on purine and related bicyclic templates. Bioorg Med Chem Lett27:551-556 (2017) 
 
Microtubule-associated protein 2
Name:Microtubule-associated protein 2
Type:PROTEIN
Mol. Mass.:199423.64
Organism:Homo sapiens (Human)
Description:ChEMBL_107603
Residue:1827
BDBM50234034
NameBDBM50234034
Synonyms:CHEMBL4093860
TypeSmall organic molecule
Emp. Form.C16H16FN5O
Mol. Mass.313.3295
SMILESFc1ccc(OC[C@H]2CCCN2c2ncnc3[nH]cnc23)cc1