Reaction Details
TargetHeat shock factor protein 1
LigandBDBM99471
Substrate/Competitorn/a
Meas. Tech.ChEMBL_1652055 (CHEMBL4001310)
IC50<10000±n/a nM
Citation Cheeseman, MDChessum, NERye, CSPasqua, AETucker, MJWilding, BEvans, LELepri, SRichards, MSharp, SYAli, SRowlands, MO'Fee, LMiah, AHayes, AHenley, ATPowers, MTe Poele, RDe Billy, EPellegrino, LRaynaud, FBurke, Rvan Montfort, RLEccles, SAWorkman, PJones, K Discovery of a Chemical Probe Bisamide (CCT251236): An Orally Bioavailable Efficacious Pirin Ligand from a Heat Shock Transcription Factor 1 (HSF1) Phenotypic Screen. J Med Chem60:180-201 (2017) 
 
Heat shock factor protein 1
Name:Heat shock factor protein 1
Type:PROTEIN
Mol. Mass.:57244.20
Organism:Homo sapiens (Human)
Description:ChEMBL_1512556
Residue:529
BDBM99471
NameBDBM99471
Synonyms:US8497274, 32
TypeSmall organic molecule
Emp. Form.C27H18F4N4O3S
Mol. Mass.554.515
SMILESFc1ccc(Oc2ccc3nc(NC(=O)C4CC4)sc3c2C#N)cc1NC(=O)Cc1cccc(c1)C(F)(F)F