Reaction Details
TargetCoagulation factor X
LigandBDBM50234135
Substrate/Competitorn/a
Meas. Tech.ChEMBL_1652332 (CHEMBL4001587)
IC50 1.14±n/a nM
Citation Zhang, GQJin, HZhao, YGuo, LGao, XWang, XTie, SShen, JWang, PGGan, HCui, HZhao, W An efficient anticoagulant candidate: Characterization, synthesis and in vivo study of a fondaparinux analogue Rrt1.17. Eur J Med Chem126:1039-1055 (2017) 
 
Coagulation factor X
Name:Coagulation factor X
Type:Enzyme
Mol. Mass.:54726.60
Organism:Homo sapiens (Human)
Description:n/a
Residue:488
BDBM50234135
NameBDBM50234135
Synonyms:CHEMBL4072190
TypeSmall organic molecule
Emp. Form.C32H44N3Na9O47S7
Mol. Mass.1654.047
SMILES[Na+].[Na+].[Na+].[Na+].[Na+].[Na+].[Na+].[Na+].[Na+].[H][C@@]1(O[C@H]2[C@H](O)[C@@H](NS([O-])(=O)=O)[C@@H](OC)O[C@@H]2COS([O-])(=O)=O)O[C@@H](C([O-])=O)[C@@]([H])(O[C@@H]2O[C@H](COS([O-])(=O)=O)[C@@]([H])(O[C@@H]3O[C@H](C([O-])=O)[C@@]([H])(O[C@H]4O[C@H](COS([O-])(=O)=O)[C@@H](O)[C@H](O)[C@H]4NC=O)[C@H](O)[C@H]3O)[C@H](OS([O-])(=O)=O)[C@H]2NS([O-])(=O)=O)[C@H](O)[C@H]1OS([O-])(=O)=O