Reaction Details
TargetDNA topoisomerase 2-alpha
LigandBDBM50233984
Substrate/Competitorn/a
Meas. Tech.ChEMBL_1652535 (CHEMBL4001790)
IC50 10000±n/a nM
Citation Hueso-Falcón, IAmesty, ÁAnaissi-Afonso, LLorenzo-Castrillejo, IMachín, FEstévez-Braun, A Synthesis and biological evaluation of naphthoquinone-coumarin conjugates as topoisomerase II inhibitors. Bioorg Med Chem Lett27:484-489 (2017) 
 
DNA topoisomerase 2-alpha
Name:DNA topoisomerase 2-alpha
Type:Protein
Mol. Mass.:174415.30
Organism:Homo sapiens (Human)
Description:P11388
Residue:1531
BDBM50233984
NameBDBM50233984
Synonyms:CHEMBL4074215
TypeSmall organic molecule
Emp. Form.C27H16O8
Mol. Mass.468.4111
SMILESOC1=C(C(c2ccc3OCOc3c2)c2c(O)c3ccccc3oc2=O)C(=O)c2ccccc2C1=O